Reaction Details
TargetRho-associated protein kinase 2
LigandBDBM50308862
Substrate/Competitorn/a
Meas. Tech.ChEMBL_607703 (CHEMBL1066168)
IC50 48±n/a nM
Citation Morwick, TBüttner, FHCywin, CLDahmann, GHickey, EJakes, SKaplita, PKashem, MAKerr, SKugler, SMao, WMarshall, DPaw, ZShih, CKWu, FYoung, E Hit to lead account of the discovery of bisbenzamide and related ureidobenzamide inhibitors of Rho kinase. J Med Chem53:759-77 (2010) 
 
Rho-associated protein kinase 2
Name:Rho-associated protein kinase 2
Type:Protein
Mol. Mass.:160885.43
Organism:Homo sapiens (Human)
Description:O75116
Residue:1388
BDBM50308862
NameBDBM50308862
Synonyms:3-[3-(4-Cyano-phenyl)-ureidomethyl]-N-(1,2,3,4-tetrahydro-isoquinolin-7-yl)-benzamide | CHEMBL590810
TypeSmall organic molecule
Emp. Form.C25H23N5O2
Mol. Mass.425.4824
SMILESO=C(NCc1cccc(c1)C(=O)Nc1ccc2CCNCc2c1)Nc1ccc(cc1)C#N