Reaction Details
TargetRho-associated protein kinase 2
LigandBDBM50308856
Substrate/Competitorn/a
Meas. Tech.ChEMBL_607685 (CHEMBL1071707)
IC50 240000±n/a nM
Citation Morwick, TBüttner, FHCywin, CLDahmann, GHickey, EJakes, SKaplita, PKashem, MAKerr, SKugler, SMao, WMarshall, DPaw, ZShih, CKWu, FYoung, E Hit to lead account of the discovery of bisbenzamide and related ureidobenzamide inhibitors of Rho kinase. J Med Chem53:759-77 (2010) 
 
Rho-associated protein kinase 2
Name:Rho-associated protein kinase 2
Type:Protein
Mol. Mass.:160885.43
Organism:Homo sapiens (Human)
Description:O75116
Residue:1388
BDBM50308856
NameBDBM50308856
Synonyms:3-[3-(3-Amido-phenyl)-ureidomethyl]-N-(4-dimethylaminomethylphenyl)-benzamide | CHEMBL603162
TypeSmall organic molecule
Emp. Form.C25H27N5O3
Mol. Mass.445.5136
SMILESCN(C)Cc1ccc(NC(=O)c2cccc(CNC(=O)Nc3cccc(c3)C(N)=O)c2)cc1