Reaction Details
TargetRho-associated protein kinase 2
LigandBDBM50308878
Substrate/Competitorn/a
Meas. Tech.ChEMBL_607703 (CHEMBL1066168)
IC50 5000±n/a nM
Citation Morwick, TBüttner, FHCywin, CLDahmann, GHickey, EJakes, SKaplita, PKashem, MAKerr, SKugler, SMao, WMarshall, DPaw, ZShih, CKWu, FYoung, E Hit to lead account of the discovery of bisbenzamide and related ureidobenzamide inhibitors of Rho kinase. J Med Chem53:759-77 (2010) 
 
Rho-associated protein kinase 2
Name:Rho-associated protein kinase 2
Type:Protein
Mol. Mass.:160885.43
Organism:Homo sapiens (Human)
Description:O75116
Residue:1388
BDBM50308878
NameBDBM50308878
Synonyms:3,4-dimethoxy-N-(3-(propylcarbamoyl)benzyl)benzamide | CHEMBL597321
TypeSmall organic molecule
Emp. Form.C20H24N2O4
Mol. Mass.356.4156
SMILESCCCNC(=O)c1cccc(CNC(=O)c2ccc(OC)c(OC)c2)c1