Reaction Details
TargetRho-associated protein kinase 2
LigandBDBM50308868
Substrate/Competitorn/a
Meas. Tech.ChEMBL_607703 (CHEMBL1066168)
IC50>6000000±n/a nM
Citation Morwick, TBüttner, FHCywin, CLDahmann, GHickey, EJakes, SKaplita, PKashem, MAKerr, SKugler, SMao, WMarshall, DPaw, ZShih, CKWu, FYoung, E Hit to lead account of the discovery of bisbenzamide and related ureidobenzamide inhibitors of Rho kinase. J Med Chem53:759-77 (2010) 
 
Rho-associated protein kinase 2
Name:Rho-associated protein kinase 2
Type:Protein
Mol. Mass.:160885.43
Organism:Homo sapiens (Human)
Description:O75116
Residue:1388
BDBM50308868
NameBDBM50308868
Synonyms:CHEMBL590072 | N-[3-(4-Dimethylaminomethyl-phenylcarbamoyl)-benzyl]-3,4-dihydroxy-benzamide
TypeSmall organic molecule
Emp. Form.C24H25N3O4
Mol. Mass.419.473
SMILESCN(C)Cc1ccc(NC(=O)c2cccc(CNC(=O)c3ccc(O)c(O)c3)c2)cc1