Reaction Details
TargetRho-associated protein kinase 2
LigandBDBM50308883
Substrate/Competitorn/a
Meas. Tech.ChEMBL_607703 (CHEMBL1066168)
IC50>6000000±n/a nM
Citation Morwick, TBüttner, FHCywin, CLDahmann, GHickey, EJakes, SKaplita, PKashem, MAKerr, SKugler, SMao, WMarshall, DPaw, ZShih, CKWu, FYoung, E Hit to lead account of the discovery of bisbenzamide and related ureidobenzamide inhibitors of Rho kinase. J Med Chem53:759-77 (2010) 
 
Rho-associated protein kinase 2
Name:Rho-associated protein kinase 2
Type:Protein
Mol. Mass.:160885.43
Organism:Homo sapiens (Human)
Description:O75116
Residue:1388
BDBM50308883
NameBDBM50308883
Synonyms:3-[(3,4-Dimethoxy-benzenesulfonylamino)-methyl]-N-(2-piperidin-3-yl-ethyl)-benzamide | CHEMBL603157
TypeSmall organic molecule
Emp. Form.C23H31N3O5S
Mol. Mass.461.574
SMILESCOc1ccc(cc1OC)S(=O)(=O)NCc1cccc(c1)C(=O)NCCC1CCCNC1