Reaction Details
TargetRho-associated protein kinase 2
LigandBDBM50308890
Substrate/Competitorn/a
Meas. Tech.ChEMBL_607703 (CHEMBL1066168)
IC50 3200000±n/a nM
Citation Morwick, TBüttner, FHCywin, CLDahmann, GHickey, EJakes, SKaplita, PKashem, MAKerr, SKugler, SMao, WMarshall, DPaw, ZShih, CKWu, FYoung, E Hit to lead account of the discovery of bisbenzamide and related ureidobenzamide inhibitors of Rho kinase. J Med Chem53:759-77 (2010) 
 
Rho-associated protein kinase 2
Name:Rho-associated protein kinase 2
Type:Protein
Mol. Mass.:160885.43
Organism:Homo sapiens (Human)
Description:O75116
Residue:1388
BDBM50308890
NameBDBM50308890
Synonyms:3-[2-(3,4-Dimethoxy-phenyl)-acetylamino]-N-(2-piperidin-3-ylethyl)-benzamide | CHEMBL592715
TypeSmall organic molecule
Emp. Form.C24H31N3O4
Mol. Mass.425.5206
SMILESCOc1ccc(CC(=O)Nc2cccc(c2)C(=O)NCCC2CCCNC2)cc1OC