Reaction Details
TargetRho-associated protein kinase 2
LigandBDBM50308869
Substrate/Competitorn/a
Meas. Tech.ChEMBL_607703 (CHEMBL1066168)
IC50 1300000±n/a nM
Citation Morwick, TBüttner, FHCywin, CLDahmann, GHickey, EJakes, SKaplita, PKashem, MAKerr, SKugler, SMao, WMarshall, DPaw, ZShih, CKWu, FYoung, E Hit to lead account of the discovery of bisbenzamide and related ureidobenzamide inhibitors of Rho kinase. J Med Chem53:759-77 (2010) 
 
Rho-associated protein kinase 2
Name:Rho-associated protein kinase 2
Type:Protein
Mol. Mass.:160885.43
Organism:Homo sapiens (Human)
Description:O75116
Residue:1388
BDBM50308869
NameBDBM50308869
Synonyms:CHEMBL589827 | N-[3-(4-Dimethylaminomethyl-phenylcarbamoyl)-benzyl]-4-methoxy-benzamide
TypeSmall organic molecule
Emp. Form.C25H27N3O3
Mol. Mass.417.5002
SMILESCOc1ccc(cc1)C(=O)NCc1cccc(c1)C(=O)Nc1ccc(CN(C)C)cc1