Reaction Details
TargetRho-associated protein kinase 2
LigandBDBM50308892
Substrate/Competitorn/a
Meas. Tech.ChEMBL_607703 (CHEMBL1066168)
IC50 110000±n/a nM
Citation Morwick, TBüttner, FHCywin, CLDahmann, GHickey, EJakes, SKaplita, PKashem, MAKerr, SKugler, SMao, WMarshall, DPaw, ZShih, CKWu, FYoung, E Hit to lead account of the discovery of bisbenzamide and related ureidobenzamide inhibitors of Rho kinase. J Med Chem53:759-77 (2010) 
 
Rho-associated protein kinase 2
Name:Rho-associated protein kinase 2
Type:Protein
Mol. Mass.:160885.43
Organism:Homo sapiens (Human)
Description:O75116
Residue:1388
BDBM50308892
NameBDBM50308892
Synonyms:CHEMBL589844 | N-{3-[3-(4-Cyano-phenyl)-ureidomethyl]-phenyl}-3-piperidin-3-yl-propionamide
TypeSmall organic molecule
Emp. Form.C23H27N5O2
Mol. Mass.405.4928
SMILESO=C(CCC1CCCNC1)Nc1cccc(CNC(=O)Nc2ccc(cc2)C#N)c1