Reaction Details
TargetRho-associated protein kinase 2
LigandBDBM50308859
Substrate/Competitorn/a
Meas. Tech.ChEMBL_607703 (CHEMBL1066168)
IC50 10000±n/a nM
Citation Morwick, TBüttner, FHCywin, CLDahmann, GHickey, EJakes, SKaplita, PKashem, MAKerr, SKugler, SMao, WMarshall, DPaw, ZShih, CKWu, FYoung, E Hit to lead account of the discovery of bisbenzamide and related ureidobenzamide inhibitors of Rho kinase. J Med Chem53:759-77 (2010) 
 
Rho-associated protein kinase 2
Name:Rho-associated protein kinase 2
Type:Protein
Mol. Mass.:160885.43
Organism:Homo sapiens (Human)
Description:O75116
Residue:1388
BDBM50308859
NameBDBM50308859
Synonyms:3-[3-(3-Chloro-4-cyano-phenyl)-ureidomethyl]-N-(3-dimethylaminomethyl-benzyl)-benzamide | CHEMBL591058
TypeSmall organic molecule
Emp. Form.C25H24ClN5O2
Mol. Mass.461.943
SMILESCN(C)Cc1ccc(NC(=O)c2cccc(CNC(=O)Nc3ccc(C#N)c(Cl)c3)c2)cc1