Reaction Details
TargetRho-associated protein kinase 2
LigandBDBM50308875
Substrate/Competitorn/a
Meas. Tech.ChEMBL_607703 (CHEMBL1066168)
IC50 46±n/a nM
Citation Morwick, TBüttner, FHCywin, CLDahmann, GHickey, EJakes, SKaplita, PKashem, MAKerr, SKugler, SMao, WMarshall, DPaw, ZShih, CKWu, FYoung, E Hit to lead account of the discovery of bisbenzamide and related ureidobenzamide inhibitors of Rho kinase. J Med Chem53:759-77 (2010) 
 
Rho-associated protein kinase 2
Name:Rho-associated protein kinase 2
Type:Protein
Mol. Mass.:160885.43
Organism:Homo sapiens (Human)
Description:O75116
Residue:1388
BDBM50308875
NameBDBM50308875
Synonyms:3,4-Dimethoxy-N-[3-(2-methyl-1,2,3,4-tetrahydro-isoquinolin-7-ylcarbamoyl)-benzyl]-benzamide | CHEMBL599791
TypeSmall organic molecule
Emp. Form.C27H29N3O4
Mol. Mass.459.5369
SMILESCOc1ccc(cc1OC)C(=O)NCc1cccc(c1)C(=O)Nc1ccc2CCN(C)Cc2c1