Reaction Details
TargetSerine/threonine-protein kinase N2
LigandBDBM50308898
Substrate/Competitorn/a
Meas. Tech.ChEMBL_607697 (CHEMBL1066162)
IC50 770±n/a nM
Citation Morwick, TBüttner, FHCywin, CLDahmann, GHickey, EJakes, SKaplita, PKashem, MAKerr, SKugler, SMao, WMarshall, DPaw, ZShih, CKWu, FYoung, E Hit to lead account of the discovery of bisbenzamide and related ureidobenzamide inhibitors of Rho kinase. J Med Chem53:759-77 (2010) 
 
Serine/threonine-protein kinase N2
Name:Serine/threonine-protein kinase N2
Type:PROTEIN
Mol. Mass.:112029.78
Organism:Homo sapiens (Human)
Description:ChEMBL_1433151
Residue:984
BDBM50308898
NameBDBM50308898
Synonyms:3-[3-(4-Amido-phenyl)-ureidomethyl]-N-(1,2,3,4-tetrahydroisoquinolin-7-yl)-benzamide | CHEMBL600852
TypeSmall organic molecule
Emp. Form.C25H25N5O3
Mol. Mass.443.4977
SMILESNC(=O)c1ccc(NC(=O)NCc2cccc(c2)C(=O)Nc2ccc3CCNCc3c2)cc1