Reaction Details
TargetCytochrome P450 3A4
LigandBDBM50308866
Substrate/Competitorn/a
Meas. Tech.ChEMBL_611721 (CHEMBL1074315)
IC50>30000±n/a nM
Citation Morwick, TBüttner, FHCywin, CLDahmann, GHickey, EJakes, SKaplita, PKashem, MAKerr, SKugler, SMao, WMarshall, DPaw, ZShih, CKWu, FYoung, E Hit to lead account of the discovery of bisbenzamide and related ureidobenzamide inhibitors of Rho kinase. J Med Chem53:759-77 (2010) 
 
Cytochrome P450 3A4
Name:Cytochrome P450 3A4
Type:Enzyme
Mol. Mass.:57349.57
Organism:Homo sapiens (Human)
Description:n/a
Residue:503
BDBM50308866
NameBDBM50308866
Synonyms:3-Chloro-N-[3-(4-dimethylaminomethyl-phenylcarbamoyl)-benzyl]-4-methoxy-benzamide | CHEMBL592709
TypeSmall organic molecule
Emp. Form.C25H26ClN3O3
Mol. Mass.451.945
SMILESCOc1ccc(cc1Cl)C(=O)NCc1cccc(c1)C(=O)Nc1ccc(CN(C)C)cc1