Reaction Details
TargetCannabinoid receptor 2
LigandBDBM50309027
Substrate/Competitorn/a
Meas. Tech.ChEMBL_612941 (CHEMBL1070893)
Ki 1384±n/a nM
Citation Scott, JDLi, SWWang, HXia, YJayne, CLMiller, MWDuffy, RABoykow, GCKowalski, TJSpar, BDStamford, AWChackalamannil, SLachowicz, JEGreenlee, WJ Diaryl piperidines as CB1 receptor antagonists. Bioorg Med Chem Lett20:1278-83 (2010) 
 
Cannabinoid receptor 2
Name:Cannabinoid receptor 2
Type:G Protein-Coupled Receptor (GPCR)
Mol. Mass.:39690.94
Organism:Homo sapiens (Human)
Description:P34972
Residue:360
BDBM50309027
NameBDBM50309027
Synonyms:(3R,6S)-1-(4-chlorophenyl)-6-(2,4-dichlorophenyl)-N-isopentylpiperidine-3-sulfonamide | CHEMBL598125
TypeSmall organic molecule
Emp. Form.C22H27Cl3N2O2S
Mol. Mass.489.886
SMILESCC(C)CCNS(=O)(=O)[C@@H]1CC[C@H](N(C1)c1ccc(Cl)cc1)c1ccc(Cl)cc1Cl