Reaction Details
TargetCannabinoid receptor 2
LigandBDBM50309029
Substrate/Competitorn/a
Meas. Tech.ChEMBL_612941 (CHEMBL1070893)
Ki 368±n/a nM
Citation Scott, JDLi, SWWang, HXia, YJayne, CLMiller, MWDuffy, RABoykow, GCKowalski, TJSpar, BDStamford, AWChackalamannil, SLachowicz, JEGreenlee, WJ Diaryl piperidines as CB1 receptor antagonists. Bioorg Med Chem Lett20:1278-83 (2010) 
 
Cannabinoid receptor 2
Name:Cannabinoid receptor 2
Type:G Protein-Coupled Receptor (GPCR)
Mol. Mass.:39690.94
Organism:Homo sapiens (Human)
Description:P34972
Residue:360
BDBM50309029
NameBDBM50309029
Synonyms:(3R,6S)-1-(4-chlorophenyl)-N-cyclohexyl-6-(2,4-dichlorophenyl)piperidine-3-sulfonamide | CHEMBL607977
TypeSmall organic molecule
Emp. Form.C23H27Cl3N2O2S
Mol. Mass.501.897
SMILESClc1ccc(cc1)N1C[C@@H](CC[C@H]1c1ccc(Cl)cc1Cl)S(=O)(=O)NC1CCCCC1