Reaction Details
TargetCannabinoid receptor 2
LigandBDBM50309041
Substrate/Competitorn/a
Meas. Tech.ChEMBL_612941 (CHEMBL1070893)
Ki>1846±n/a nM
Citation Scott, JDLi, SWWang, HXia, YJayne, CLMiller, MWDuffy, RABoykow, GCKowalski, TJSpar, BDStamford, AWChackalamannil, SLachowicz, JEGreenlee, WJ Diaryl piperidines as CB1 receptor antagonists. Bioorg Med Chem Lett20:1278-83 (2010) 
 
Cannabinoid receptor 2
Name:Cannabinoid receptor 2
Type:G Protein-Coupled Receptor (GPCR)
Mol. Mass.:39690.94
Organism:Homo sapiens (Human)
Description:P34972
Residue:360
BDBM50309041
NameBDBM50309041
Synonyms:CHEMBL601936 | tert-butyl 4-(((3S,6S)-1-(4-chlorophenyl)-6-(2,4-dichlorophenyl)piperidin-3-yl)methyl)piperazine-1-carboxylate
TypeSmall organic molecule
Emp. Form.C27H34Cl3N3O2
Mol. Mass.538.937
SMILESCC(C)(C)OC(=O)N1CCN(C[C@@H]2CC[C@H](N(C2)c2ccc(Cl)cc2)c2ccc(Cl)cc2Cl)CC1