Reaction Details
TargetCannabinoid receptor 1
LigandBDBM50309032
Substrate/Competitorn/a
Meas. Tech.ChEMBL_612940 (CHEMBL1070892)
Ki 63±n/a nM
Citation Scott, JDLi, SWWang, HXia, YJayne, CLMiller, MWDuffy, RABoykow, GCKowalski, TJSpar, BDStamford, AWChackalamannil, SLachowicz, JEGreenlee, WJ Diaryl piperidines as CB1 receptor antagonists. Bioorg Med Chem Lett20:1278-83 (2010) 
 
Cannabinoid receptor 1
Name:Cannabinoid receptor 1
Type:G Protein-Coupled Receptor (GPCR)
Mol. Mass.:52868.96
Organism:Homo sapiens (Human)
Description:P21554
Residue:472
BDBM50309032
NameBDBM50309032
Synonyms:(3R,6S)-N-(4-chlorobenzyl)-1-(4-chlorophenyl)-6-(2,4-dichlorophenyl)piperidine-3-carboxamide | CHEMBL590346
TypeSmall organic molecule
Emp. Form.C25H22Cl4N2O
Mol. Mass.508.267
SMILESClc1ccc(CNC(=O)[C@@H]2CC[C@H](N(C2)c2ccc(Cl)cc2)c2ccc(Cl)cc2Cl)cc1