Reaction Details
TargetCannabinoid receptor 1
LigandBDBM50309034
Substrate/Competitorn/a
Meas. Tech.ChEMBL_612940 (CHEMBL1070892)
Ki 33±n/a nM
Citation Scott, JDLi, SWWang, HXia, YJayne, CLMiller, MWDuffy, RABoykow, GCKowalski, TJSpar, BDStamford, AWChackalamannil, SLachowicz, JEGreenlee, WJ Diaryl piperidines as CB1 receptor antagonists. Bioorg Med Chem Lett20:1278-83 (2010) 
 
Cannabinoid receptor 1
Name:Cannabinoid receptor 1
Type:G Protein-Coupled Receptor (GPCR)
Mol. Mass.:52868.96
Organism:Homo sapiens (Human)
Description:P21554
Residue:472
BDBM50309034
NameBDBM50309034
Synonyms:(3R,6S)-1-(4-chlorophenyl)-6-(2,4-dichlorophenyl)-N-isobutylpiperidine-3-carboxamide | CHEMBL590481
TypeSmall organic molecule
Emp. Form.C22H25Cl3N2O
Mol. Mass.439.806
SMILESCC(C)CNC(=O)[C@@H]1CC[C@H](N(C1)c1ccc(Cl)cc1)c1ccc(Cl)cc1Cl