Reaction Details
TargetCannabinoid receptor 1
LigandBDBM50309044
Substrate/Competitorn/a
Meas. Tech.ChEMBL_612940 (CHEMBL1070892)
Ki 42±n/a nM
Citation Scott, JDLi, SWWang, HXia, YJayne, CLMiller, MWDuffy, RABoykow, GCKowalski, TJSpar, BDStamford, AWChackalamannil, SLachowicz, JEGreenlee, WJ Diaryl piperidines as CB1 receptor antagonists. Bioorg Med Chem Lett20:1278-83 (2010) 
 
Cannabinoid receptor 1
Name:Cannabinoid receptor 1
Type:G Protein-Coupled Receptor (GPCR)
Mol. Mass.:52868.96
Organism:Homo sapiens (Human)
Description:P21554
Residue:472
BDBM50309044
NameBDBM50309044
Synonyms:CHEMBL591066 | N-(2-((3S,6S)-1-(4-chlorophenyl)-6-(2,4-dichlorophenyl)piperidin-3-yl)ethyl)acetamide
TypeSmall organic molecule
Emp. Form.C21H23Cl3N2O
Mol. Mass.425.779
SMILESCC(=O)NCC[C@@H]1CC[C@H](N(C1)c1ccc(Cl)cc1)c1ccc(Cl)cc1Cl