Reaction Details
TargetCannabinoid receptor 1
LigandBDBM50309047
Substrate/Competitorn/a
Meas. Tech.ChEMBL_612940 (CHEMBL1070892)
Ki 3.8±n/a nM
Citation Scott, JDLi, SWWang, HXia, YJayne, CLMiller, MWDuffy, RABoykow, GCKowalski, TJSpar, BDStamford, AWChackalamannil, SLachowicz, JEGreenlee, WJ Diaryl piperidines as CB1 receptor antagonists. Bioorg Med Chem Lett20:1278-83 (2010) 
 
Cannabinoid receptor 1
Name:Cannabinoid receptor 1
Type:G Protein-Coupled Receptor (GPCR)
Mol. Mass.:52868.96
Organism:Homo sapiens (Human)
Description:P21554
Residue:472
BDBM50309047
NameBDBM50309047
Synonyms:CHEMBL591352 | N-(2-((3S,6S)-1-(4-chlorophenyl)-6-(2,4-dichlorophenyl)piperidin-3-yl)ethyl)cyclopropanesulfonamide
TypeSmall organic molecule
Emp. Form.C22H25Cl3N2O2S
Mol. Mass.487.87
SMILESClc1ccc(cc1)N1C[C@H](CCNS(=O)(=O)C2CC2)CC[C@H]1c1ccc(Cl)cc1Cl