Reaction Details
TargetCannabinoid receptor 1
LigandBDBM50309051
Substrate/Competitorn/a
Meas. Tech.ChEMBL_612940 (CHEMBL1070892)
Ki 158±n/a nM
Citation Scott, JDLi, SWWang, HXia, YJayne, CLMiller, MWDuffy, RABoykow, GCKowalski, TJSpar, BDStamford, AWChackalamannil, SLachowicz, JEGreenlee, WJ Diaryl piperidines as CB1 receptor antagonists. Bioorg Med Chem Lett20:1278-83 (2010) 
 
Cannabinoid receptor 1
Name:Cannabinoid receptor 1
Type:G Protein-Coupled Receptor (GPCR)
Mol. Mass.:52868.96
Organism:Homo sapiens (Human)
Description:P21554
Residue:472
BDBM50309051
NameBDBM50309051
Synonyms:CHEMBL589169 | N-(((3R,6S)-1-(4-chlorophenyl)-6-(2,4-dichlorophenyl)piperidin-3-yl)methyl)cyclopropanesulfonamide
TypeSmall organic molecule
Emp. Form.C21H23Cl3N2O2S
Mol. Mass.473.844
SMILESClc1ccc(cc1)N1C[C@H](CNS(=O)(=O)C2CC2)CC[C@H]1c1ccc(Cl)cc1Cl