Reaction Details
TargetCannabinoid receptor 1
LigandBDBM50309052
Substrate/Competitorn/a
Meas. Tech.ChEMBL_612940 (CHEMBL1070892)
Ki 133±n/a nM
Citation Scott, JDLi, SWWang, HXia, YJayne, CLMiller, MWDuffy, RABoykow, GCKowalski, TJSpar, BDStamford, AWChackalamannil, SLachowicz, JEGreenlee, WJ Diaryl piperidines as CB1 receptor antagonists. Bioorg Med Chem Lett20:1278-83 (2010) 
 
Cannabinoid receptor 1
Name:Cannabinoid receptor 1
Type:G Protein-Coupled Receptor (GPCR)
Mol. Mass.:52868.96
Organism:Homo sapiens (Human)
Description:P21554
Residue:472
BDBM50309052
NameBDBM50309052
Synonyms:((3S,6S)-1-(4-chlorophenyl)-6-(2,4-dichlorophenyl)piperidin-3-yl)methanamine | CHEMBL590569
TypeSmall organic molecule
Emp. Form.C18H19Cl3N2
Mol. Mass.369.716
SMILESNC[C@@H]1CC[C@H](N(C1)c1ccc(Cl)cc1)c1ccc(Cl)cc1Cl