Reaction Details
TargetCannabinoid receptor 1
LigandBDBM50309056
Substrate/Competitorn/a
Meas. Tech.ChEMBL_612940 (CHEMBL1070892)
Ki>1636±n/a nM
Citation Scott, JDLi, SWWang, HXia, YJayne, CLMiller, MWDuffy, RABoykow, GCKowalski, TJSpar, BDStamford, AWChackalamannil, SLachowicz, JEGreenlee, WJ Diaryl piperidines as CB1 receptor antagonists. Bioorg Med Chem Lett20:1278-83 (2010) 
 
Cannabinoid receptor 1
Name:Cannabinoid receptor 1
Type:G Protein-Coupled Receptor (GPCR)
Mol. Mass.:52868.96
Organism:Homo sapiens (Human)
Description:P21554
Residue:472
BDBM50309056
NameBDBM50309056
Synonyms:CHEMBL589841 | cis-1,2-bis(4-chlorophenyl)-5-(3,4-difluorobenzyl)piperidine
TypeSmall organic molecule
Emp. Form.C24H21Cl2F2N
Mol. Mass.432.333
SMILESFc1ccc(C[C@@H]2CC[C@@H](N(C2)c2ccc(Cl)cc2)c2ccc(Cl)cc2)cc1F