Reaction Details
TargetCannabinoid receptor 2
LigandBDBM85739
Substrate/Competitorn/a
Meas. Tech.ChEMBL_609766 (CHEMBL1069384)
Ki 130±n/a nM
Citation Lange, JHvan der Neut, MAWals, HCKuil, GDBorst, AJMulder, Aden Hartog, APZilaout, HGoutier, Wvan Stuivenberg, HHvan Vliet, BJ Synthesis and SAR of novel imidazoles as potent and selective cannabinoid CB2 receptor antagonists with high binding efficiencies. Bioorg Med Chem Lett20:1084-9 (2010) 
 
Cannabinoid receptor 2
Name:Cannabinoid receptor 2
Type:G Protein-Coupled Receptor (GPCR)
Mol. Mass.:39690.94
Organism:Homo sapiens (Human)
Description:P34972
Residue:360
BDBM85739
NameBDBM85739
Synonyms:CHEMBL178372 N-(1,3-Benzodioxole-5-ylmethyl)-2-oxo-7-methoxy-8-pentoxy-1,2-dihydro-3-quinolinecarboxamide
TypeSmall organic molecule
Emp. Form.C24H26N2O6
Mol. Mass.438.473
SMILESCCCCCOc1c(OC)ccc2cc(C(=O)NCc3ccc4OCOc4c3)c(=O)[nH]c12