Reaction Details
TargetCannabinoid receptor 2
LigandBDBM50309537
Substrate/Competitorn/a
Meas. Tech.ChEMBL_609766 (CHEMBL1069384)
Ki 3.5±n/a nM
Citation Lange, JHvan der Neut, MAWals, HCKuil, GDBorst, AJMulder, Aden Hartog, APZilaout, HGoutier, Wvan Stuivenberg, HHvan Vliet, BJ Synthesis and SAR of novel imidazoles as potent and selective cannabinoid CB2 receptor antagonists with high binding efficiencies. Bioorg Med Chem Lett20:1084-9 (2010) 
 
Cannabinoid receptor 2
Name:Cannabinoid receptor 2
Type:G Protein-Coupled Receptor (GPCR)
Mol. Mass.:39690.94
Organism:Homo sapiens (Human)
Description:P34972
Residue:360
BDBM50309537
NameBDBM50309537
Synonyms:2,5-dimethyl-1-phenyl-N-(2-(trifluoromethyl)benzyl)-1H-imidazole-4-carboxamide | CHEMBL598463
TypeSmall organic molecule
Emp. Form.C20H18F3N3O
Mol. Mass.373.3716
SMILESCc1nc(C(=O)NCc2ccccc2C(F)(F)F)c(C)n1-c1ccccc1