Reaction Details
TargetCannabinoid receptor 2
LigandBDBM50309546
Substrate/Competitorn/a
Meas. Tech.ChEMBL_609766 (CHEMBL1069384)
Ki 20±n/a nM
Citation Lange, JHvan der Neut, MAWals, HCKuil, GDBorst, AJMulder, Aden Hartog, APZilaout, HGoutier, Wvan Stuivenberg, HHvan Vliet, BJ Synthesis and SAR of novel imidazoles as potent and selective cannabinoid CB2 receptor antagonists with high binding efficiencies. Bioorg Med Chem Lett20:1084-9 (2010) 
 
Cannabinoid receptor 2
Name:Cannabinoid receptor 2
Type:G Protein-Coupled Receptor (GPCR)
Mol. Mass.:39690.94
Organism:Homo sapiens (Human)
Description:P34972
Residue:360
BDBM50309546
NameBDBM50309546
Synonyms:1-Cyclohexyl-2,5-dimethyl-1H-imidazole-4-carboxylic acid adamantan-1-ylamide | CHEMBL597084
TypeSmall organic molecule
Emp. Form.C22H33N3O
Mol. Mass.355.5169
SMILESCc1nc(C(=O)NC23CC4CC(CC(C4)C2)C3)c(C)n1C1CCCCC1