Reaction Details
TargetSynaptic vesicular amine transporter
LigandBDBM50080827
Substrate/Competitorn/a
Meas. Tech.ChEMBL_610810 (CHEMBL1068127)
Ki 970±n/a nM
Citation Hojahmat, MHorton, DBNorrholm, SDMiller, DKGrinevich, VPDeaciuc, AGDwoskin, LPCrooks, PA Lobeline esters as novel ligands for neuronal nicotinic acetylcholine receptors and neurotransmitter transporters. Bioorg Med Chem18:640-9 (2010) 
 
Synaptic vesicular amine transporter
Name:Synaptic vesicular amine transporter
Type:PROTEIN
Mol. Mass.:55709.61
Organism:Homo sapiens (Human)
Description:ChEMBL_610810
Residue:514
BDBM50080827
NameBDBM50080827
Synonyms:(2R,6S)-1-Methyl-2,6-diphenethyl-piperidine CHEMBL1085811 Lobelane | cis-N-methyl-2,6-diphenethylpiperidine
TypeSmall organic molecule
Emp. Form.C22H29N
Mol. Mass.307.4724
SMILESCN1[C@@H](CCc2ccccc2)CCC[C@H]1CCc1ccccc1