Reaction Details
TargetBeta-secretase 1
LigandBDBM50303717
Substrate/Competitorn/a
Meas. Tech.ChEMBL_612751 (CHEMBL1071577)
IC50 20±n/a nM
Citation Malamas, MSBarnes, KJohnson, MHui, YZhou, PTurner, JHu, YWagner, EFan, KChopra, ROlland, ABard, JPangalos, MReinhart, PRobichaud, AJ Di-substituted pyridinyl aminohydantoins as potent and highly selective human beta-secretase (BACE1) inhibitors. Bioorg Med Chem18:630-9 (2010) 
 
Beta-secretase 1
Name:Beta-secretase 1
Type:Protein
Mol. Mass.:55755.10
Organism:Homo sapiens (Human)
Description:P56817
Residue:501
BDBM50303717
NameBDBM50303717
Synonyms:2-amino-4-(3-(2-fluoropyridin-3-yl)phenyl)-4-(4-methoxy-3-methylphenyl)-1-methyl-1H-imidazol-5(4H)-one rac-2-amino-4-(3-(2-fluoropyridin-3-yl)phenyl)-4-(4-methoxy-3-methylphenyl)-1-methyl-1H-imidazol-5(4H)-one
TypeSmall organic molecule
Emp. Form.C23H21FN4O2
Mol. Mass.404.4368
SMILESCOc1ccc(cc1C)C1(N=C(N)N(C)C1=O)c1cccc(c1)-c1cccnc1F