Reaction Details
TargetThymidine phosphorylase
LigandBDBM50310199
Substrate/Competitorn/a
Meas. Tech.ChEMBL_607911 (CHEMBL1066239)
Ki 236±n/a nM
Citation Kocalka, PRejman, DVanek, VRinnová, MTomecková, IKrálíková, SPetrová, MPáv, OPohl, RBudesínský, MLiboska, RTocík, ZPanova, NVotruba, IRosenberg, I Structural diversity of nucleoside phosphonic acids as a key factor in the discovery of potent inhibitors of rat T-cell lymphoma thymidine phosphorylase. Bioorg Med Chem Lett20:862-5 (2010) 
 
Thymidine phosphorylase
Name:Thymidine phosphorylase
Type:Enzyme
Mol. Mass.:49948.87
Organism:Homo sapiens (Human)
Description:The recombinant human thymidine phosphorylase (V79TP) was expressed in V79 Chinese hamster cells (Sigma, T-9319).
Residue:482
BDBM50310199
NameBDBM50310199
Synonyms:(1-fluoro-3-(5-methyl-2,4-dioxo-3,4-dihydropyrimidin-1(2H)-yl)propan-2-yloxy)methylphosphonic acid | CHEMBL592394
TypeSmall organic molecule
Emp. Form.C9H14FN2O6P
Mol. Mass.296.1894
SMILESCc1cn(CC(CF)OCP(O)(O)=O)c(=O)[nH]c1=O