Reaction Details
TargetProthrombin
LigandBDBM50378698
Substrate/Competitorn/a
Meas. Tech.ChEMBL_621471 (CHEMBL1100032)
Kd 390±n/a nM
Citation Li, YShi, JLuo, ZJiang, HChen, XWang, FWu, XGuo, Q Photoregulation of thrombin aptamer activity using Bhc caging strategy. Bioorg Med Chem Lett19:5368-71 (2009) 
 
Prothrombin
Name:Prothrombin
Type:Protein
Mol. Mass.:70029.57
Organism:Homo sapiens (Human)
Description:P00734
Residue:622
BDBM50378698
NameBDBM50378698
Synonyms:CHEMBL1078314
TypeSmall organic molecule
Emp. Form.C150H187N57O103P14
Mol. Mass.4870.0425
SMILESCc1cn([C@H]2C[C@H](OP(O)(=O)OC[C@H]3O[C@H]([C@H](O)[C@@H]3OP(O)(=O)OC[C@H]3O[C@H]([C@H](O)[C@@H]3O)n3cnc4c3nc(N)[nH]c4=O)n3cnc4c3nc(N)[nH]c4=O)[C@@H](COP(O)(=O)O[C@H]3C[C@@H](O[C@@H]3COP(O)(=O)O[C@@H]3[C@@H](COP(O)(=O)O[C@@H]4[C@@H](COP(O)(=O)O[C@H]5C[C@@H](O[C@@H]5COP(O)(=O)O[C@@H]5[C@@H](COP(O)(=O)O[C@H]6C[C@@H](O[C@@H]6COP(O)(=O)O[C@@H]6[C@@H](COP(O)(=O)O[C@@H]7[C@@H](COP(O)(=O)O[C@H]8C[C@@H](O[C@@H]8COP(O)(=O)O[C@H]8C[C@@H](O[C@@H]8COP(O)(=O)O[C@@H]8[C@@H](COP(O)(=O)O[C@@H]9[C@@H](CO)O[C@H]([C@@H]9O)n9cnc%10c9nc(N)[nH]c%10=O)O[C@H]([C@@H]8O)n8cnc9c8nc(N)[nH]c9=O)n8cc(C)c(=O)[nH]c8=O)n8cc(C)c(=O)[nH]c8=O)O[C@H]([C@@H]7O)n7cnc8c7nc(N)[nH]c8=O)O[C@H]([C@@H]6O)n6cnc7c6nc(N)[nH]c7=O)n6cc(C)c(=O)[nH]c6=O)O[C@H]([C@@H]5O)n5cnc6c5nc(N)[nH]c6=O)n5cc(C)c(=O)[nH]c5=O)O[C@H]([C@@H]4O)n4cnc5c4nc(N)[nH]c5=O)O[C@H]([C@@H]3O)n3cnc4c3nc(N)[nH]c4=O)n3cc(C)c(=O)[nH]c3=O)O2)c(=O)[nH]c1=O