Reaction Details
TargetMitogen-activated protein kinase 9
LigandBDBM50310966
Substrate/Competitorn/a
Meas. Tech.ChEMBL_618898 (CHEMBL1101789)
IC50>200000±n/a nM
Citation Selness, SRDevraj, RVMonahan, JBBoehm, TLWalker, JKDevadas, BDurley, RCKurumbail, RShieh, HXing, LHepperle, MRucker, PVJerome, KDBenson, AGMarrufo, LDMadsen, HMHitchcock, JOwen, TJChristie, LPromo, MAHickory, BSAlvira, ENaing, WBlevis-Bal, R Discovery of N-substituted pyridinones as potent and selective inhibitors of p38 kinase. Bioorg Med Chem Lett19:5851-6 (2009) 
 
Mitogen-activated protein kinase 9
Name:Mitogen-activated protein kinase 9
Type:Enzyme
Mol. Mass.:48131.49
Organism:Homo sapiens (Human)
Description:JNK-2 was purchased from Upstate Cell Signaling Solutions (formerly Upstate Biotechnology).
Residue:424
BDBM50310966
NameBDBM50310966
Synonyms:4-((3-bromo-4-(2,4-difluorobenzyloxy)-6-methyl-2-oxopyridin-1(2H)-yl)methyl)benzamide | CHEMBL1078859
TypeSmall organic molecule
Emp. Form.C21H17BrF2N2O3
Mol. Mass.463.272
SMILESCc1cc(OCc2ccc(F)cc2F)c(Br)c(=O)n1Cc1ccc(cc1)C(N)=O