Reaction Details
TargetMitogen-activated protein kinase 14
LigandBDBM50310982
Substrate/Competitorn/a
Meas. Tech.ChEMBL_618897 (CHEMBL1101788)
IC50 120±n/a nM
Citation Selness, SRDevraj, RVMonahan, JBBoehm, TLWalker, JKDevadas, BDurley, RCKurumbail, RShieh, HXing, LHepperle, MRucker, PVJerome, KDBenson, AGMarrufo, LDMadsen, HMHitchcock, JOwen, TJChristie, LPromo, MAHickory, BSAlvira, ENaing, WBlevis-Bal, R Discovery of N-substituted pyridinones as potent and selective inhibitors of p38 kinase. Bioorg Med Chem Lett19:5851-6 (2009) 
 
Mitogen-activated protein kinase 14
Name:Mitogen-activated protein kinase 14
Type:Serine/threonine-protein kinase
Mol. Mass.:41286.76
Organism:Homo sapiens (Human)
Description:Q16539
Residue:360
BDBM50310982
NameBDBM50310982
Synonyms:1-(4-(aminomethyl)benzyl)-3-bromo-4-(2,4-difluorobenzyloxy)-6-methylpyridin-2(1H)-one | CHEMBL1079310
TypeSmall organic molecule
Emp. Form.C21H19BrF2N2O2
Mol. Mass.449.289
SMILESCc1cc(OCc2ccc(F)cc2F)c(Br)c(=O)n1Cc1ccc(CN)cc1