Reaction Details
TargetSuccinyl-diaminopimelate desuccinylase
LigandBDBM21642
Substrate/Competitorn/a
Meas. Tech.ChEMBL_617887 (CHEMBL1101552)
IC50 3300±n/a nM
Citation Gillner, DArmoush, NHolz, RCBecker, DP Inhibitors of bacterial N-succinyl-L,L-diaminopimelic acid desuccinylase (DapE) and demonstration of in vitro antimicrobial activity. Bioorg Med Chem Lett19:6350-2 (2009) 
 
Succinyl-diaminopimelate desuccinylase
Name:Succinyl-diaminopimelate desuccinylase
Type:PROTEIN
Mol. Mass.:41343.05
Organism:Haemophilus influenzae
Description:ChEMBL_617887
Residue:377
BDBM21642
NameBDBM21642
Synonyms:(2S)-1-[(2S)-2-methyl-3-sulfanylpropanoyl]pyrrolidine-2-carboxylic acid Capozide Lopirin SQ14534 | US11491146, Compound L-Captopril
TypeSmall organic molecule
Emp. Form.C9H15NO3S
Mol. Mass.217.285
SMILESC[C@H](CS)C(=O)N1CCC[C@H]1C(O)=O