Reaction Details
TargetTyrosine-protein phosphatase non-receptor type 1
LigandBDBM50311581
Substrate/Competitorn/a
Meas. Tech.ChEMBL_618616 (CHEMBL1101504)
IC50 8800±n/a nM
Citation Nguyen, PHLe, TVThuong, PTDao, TTNdinteh, DTMbafor, JTKang, KWOh, WK Cytotoxic and PTP1B inhibitory activities from Erythrina abyssinica. Bioorg Med Chem Lett19:6745-9 (2009) 
 
Tyrosine-protein phosphatase non-receptor type 1
Name:Tyrosine-protein phosphatase non-receptor type 1
Type:Protein phosphatase
Mol. Mass.:49963.76
Organism:Homo sapiens (Human)
Description:Human recombinant GST-fusion PTP1B (1-435).
Residue:435
BDBM50311581
NameBDBM50311581
Synonyms:CHEMBL1086764 | erysubin E
TypeSmall organic molecule
Emp. Form.C25H26O5
Mol. Mass.406.4709
SMILES[#6]\[#6](-[#6])=[#6]/[#6]-c1cc2-[#6@@H]3-[#8]-c4c(ccc5-[#8]C([#6])([#6])[#6]=[#6]-c45)[C@]3([#8])[#6]-[#8]-c2cc1-[#8]