Reaction Details
TargetTyrosine-protein phosphatase non-receptor type 1
LigandBDBM50311583
Substrate/Competitorn/a
Meas. Tech.ChEMBL_618616 (CHEMBL1101504)
IC50>30000±n/a nM
Citation Nguyen, PHLe, TVThuong, PTDao, TTNdinteh, DTMbafor, JTKang, KWOh, WK Cytotoxic and PTP1B inhibitory activities from Erythrina abyssinica. Bioorg Med Chem Lett19:6745-9 (2009) 
 
Tyrosine-protein phosphatase non-receptor type 1
Name:Tyrosine-protein phosphatase non-receptor type 1
Type:Protein phosphatase
Mol. Mass.:49963.76
Organism:Homo sapiens (Human)
Description:Human recombinant GST-fusion PTP1B (1-435).
Residue:435
BDBM50311583
NameBDBM50311583
Synonyms:Abyssinone II phaseolidin sophorapterocarpan A
TypeSmall organic molecule
Emp. Form.C20H20O4
Mol. Mass.324.3704
SMILES[#6]\[#6](-[#6])=[#6]\[#6]-c1c2-[#8]-[#6@@H]-3-[#6@@H](-[#6]-[#8]-c4cc(-[#8])ccc-34)-c2ccc1-[#8]