Reaction Details
TargetTyrosine-protein phosphatase non-receptor type 1
LigandBDBM50311575
Substrate/Competitorn/a
Meas. Tech.ChEMBL_618616 (CHEMBL1101504)
IC50>30000±n/a nM
Citation Nguyen, PHLe, TVThuong, PTDao, TTNdinteh, DTMbafor, JTKang, KWOh, WK Cytotoxic and PTP1B inhibitory activities from Erythrina abyssinica. Bioorg Med Chem Lett19:6745-9 (2009) 
 
Tyrosine-protein phosphatase non-receptor type 1
Name:Tyrosine-protein phosphatase non-receptor type 1
Type:Protein phosphatase
Mol. Mass.:49963.76
Organism:Homo sapiens (Human)
Description:Human recombinant GST-fusion PTP1B (1-435).
Residue:435
BDBM50311575
NameBDBM50311575
Synonyms:CHEMBL1079408 | Eryvarin K
TypeSmall organic molecule
Emp. Form.C21H22O5
Mol. Mass.354.3964
SMILES[#6]-[#8]-c1cc2-[#6@@H]-3-[#6]-[#8]-c4cc(-[#8])c(-[#6]\[#6]=[#6](\[#6])-[#6])cc4-[#6@@H]-3-[#8]-c2cc1-[#8]