Reaction Details
TargetHeat shock protein HSP 90-beta
LigandBDBM20926
Substrate/Competitorn/a
Meas. Tech.ChEMBL_616156 (CHEMBL1100068)
Ki 0.069±n/a nM
Citation Biamonte, MAVan de Water, RArndt, JWScannevin, RHPerret, DLee, WC Heat shock protein 90: inhibitors in clinical trials. J Med Chem53:3-17 (2010) 
 
Heat shock protein HSP 90-beta
Name:Heat shock protein HSP 90-beta
Type:Molecular Chaperone
Mol. Mass.:83229.45
Organism:Homo sapiens (Human)
Description:P08238
Residue:724
BDBM20926
NameBDBM20926
Synonyms:5-[2,4-dihydroxy-5-(propan-2-yl)phenyl]-N-ethyl-4-[4-(morpholin-4-ylmethyl)phenyl]-1,2-oxazole-3-carboxamide VER-52296/NVP-AUY922
TypeSmall organic molecule
Emp. Form.C26H31N3O5
Mol. Mass.465.5414
SMILESCCNC(=O)c1noc(c1-c1ccc(CN2CCOCC2)cc1)-c1cc(C(C)C)c(O)cc1O