Reaction Details
TargetHeat shock protein HSP 90-beta
LigandBDBM20800
Substrate/Competitorn/a
Meas. Tech.ChEMBL_616154 (CHEMBL1100066)
Ki 1.7±n/a nM
Citation Biamonte, MAVan de Water, RArndt, JWScannevin, RHPerret, DLee, WC Heat shock protein 90: inhibitors in clinical trials. J Med Chem53:3-17 (2010) 
 
Heat shock protein HSP 90-beta
Name:Heat shock protein HSP 90-beta
Type:Molecular Chaperone
Mol. Mass.:83229.45
Organism:Homo sapiens (Human)
Description:P08238
Residue:724
BDBM20800
NameBDBM20800
Synonyms:2-amino-6-halopurine analogue, 20 CHEMBL467399 | hsp90_107
TypeSmall organic molecule
Emp. Form.C14H15ClN6O
Mol. Mass.318.762
SMILESCOc1c(C)cnc(Cn2cnc3c(Cl)nc(N)nc23)c1C