Reaction Details
TargetHeat shock protein 75 kDa, mitochondrial
LigandBDBM20926
Substrate/Competitorn/a
Meas. Tech.ChEMBL_616200 (CHEMBL1100285)
IC50 535±n/a nM
Citation Biamonte, MAVan de Water, RArndt, JWScannevin, RHPerret, DLee, WC Heat shock protein 90: inhibitors in clinical trials. J Med Chem53:3-17 (2010) 
 
Heat shock protein 75 kDa, mitochondrial
Name:Heat shock protein 75 kDa, mitochondrial
Type:PROTEIN
Mol. Mass.:80120.13
Organism:Homo sapiens (Human)
Description:ChEMBL_1478164
Residue:704
BDBM20926
NameBDBM20926
Synonyms:5-[2,4-dihydroxy-5-(propan-2-yl)phenyl]-N-ethyl-4-[4-(morpholin-4-ylmethyl)phenyl]-1,2-oxazole-3-carboxamide VER-52296/NVP-AUY922
TypeSmall organic molecule
Emp. Form.C26H31N3O5
Mol. Mass.465.5414
SMILESCCNC(=O)c1noc(c1-c1ccc(CN2CCOCC2)cc1)-c1cc(C(C)C)c(O)cc1O