Reaction Details
TargetCannabinoid receptor 1
LigandBDBM50312827
Substrate/Competitorn/a
Meas. Tech.ChEMBL_615852 (CHEMBL1101962)
Ki 37±n/a nM
Citation Lange, JHvan der Neut, MAden Hartog, APWals, HCHoogendoorn, Jvan Stuivenberg, HHvan Vliet, BJKruse, CG Synthesis, SAR and intramolecular hydrogen bonding pattern of 1,3,5-trisubstituted 4,5-dihydropyrazoles as potent cannabinoid CB(1) receptor antagonists. Bioorg Med Chem Lett20:1752-7 (2010) 
 
Cannabinoid receptor 1
Name:Cannabinoid receptor 1
Type:G Protein-Coupled Receptor (GPCR)
Mol. Mass.:52868.96
Organism:Homo sapiens (Human)
Description:P21554
Residue:472
BDBM50312827
NameBDBM50312827
Synonyms:CHEMBL1081305 | N'-(4-chlorophenylsulfonyl)-1-(2,4-dichlorophenyl)-N-methyl-5-phenyl-4,5-dihydro-1H-pyrazole-3-carboximidamide
TypeSmall organic molecule
Emp. Form.C23H19Cl3N4O2S
Mol. Mass.521.847
SMILESCN=C(NS(=O)(=O)c1ccc(Cl)cc1)C1=NN(C(C1)c1ccccc1)c1ccc(Cl)cc1Cl