Reaction Details
TargetCannabinoid receptor 2
LigandBDBM50312828
Substrate/Competitorn/a
Meas. Tech.ChEMBL_615854 (CHEMBL1101964)
Ki 179±n/a nM
Citation Lange, JHvan der Neut, MAden Hartog, APWals, HCHoogendoorn, Jvan Stuivenberg, HHvan Vliet, BJKruse, CG Synthesis, SAR and intramolecular hydrogen bonding pattern of 1,3,5-trisubstituted 4,5-dihydropyrazoles as potent cannabinoid CB(1) receptor antagonists. Bioorg Med Chem Lett20:1752-7 (2010) 
 
Cannabinoid receptor 2
Name:Cannabinoid receptor 2
Type:G Protein-Coupled Receptor (GPCR)
Mol. Mass.:39690.94
Organism:Homo sapiens (Human)
Description:P34972
Residue:360
BDBM50312828
NameBDBM50312828
Synonyms:1-(2,4-dichlorophenyl)-N-methyl-5-phenyl-N'-(4-(trifluoromethyl)phenylsulfonyl)-4,5-dihydro-1H-pyrazole-3-carboximidamide | CHEMBL1081306
TypeSmall organic molecule
Emp. Form.C24H19Cl2F3N4O2S
Mol. Mass.555.399
SMILESCN=C(NS(=O)(=O)c1ccc(cc1)C(F)(F)F)C1=NN(C(C1)c1ccccc1)c1ccc(Cl)cc1Cl