Reaction Details
TargetCannabinoid receptor 2
LigandBDBM50312832
Substrate/Competitorn/a
Meas. Tech.ChEMBL_615854 (CHEMBL1101964)
Ki>1000±n/a nM
Citation Lange, JHvan der Neut, MAden Hartog, APWals, HCHoogendoorn, Jvan Stuivenberg, HHvan Vliet, BJKruse, CG Synthesis, SAR and intramolecular hydrogen bonding pattern of 1,3,5-trisubstituted 4,5-dihydropyrazoles as potent cannabinoid CB(1) receptor antagonists. Bioorg Med Chem Lett20:1752-7 (2010) 
 
Cannabinoid receptor 2
Name:Cannabinoid receptor 2
Type:G Protein-Coupled Receptor (GPCR)
Mol. Mass.:39690.94
Organism:Homo sapiens (Human)
Description:P34972
Residue:360
BDBM50312832
NameBDBM50312832
Synonyms:3-(4-chlorophenyl)-N-methyl-4-phenyl-N'-(4-(trifluoromethyl)piperidin-1-ylsulfonyl)-4,5-dihydro-1H-pyrazole-1-carboximidamide | CHEMBL1081213
TypeSmall organic molecule
Emp. Form.C23H25ClF3N5O2S
Mol. Mass.527.99
SMILESCNC(=NS(=O)(=O)N1CCC(CC1)C(F)(F)F)N1CC(C(=N1)c1ccc(Cl)cc1)c1ccccc1