Reaction Details
TargetCannabinoid receptor 2
LigandBDBM50300458
Substrate/Competitorn/a
Meas. Tech.ChEMBL_615854 (CHEMBL1101964)
Ki 219±n/a nM
Citation Lange, JHvan der Neut, MAden Hartog, APWals, HCHoogendoorn, Jvan Stuivenberg, HHvan Vliet, BJKruse, CG Synthesis, SAR and intramolecular hydrogen bonding pattern of 1,3,5-trisubstituted 4,5-dihydropyrazoles as potent cannabinoid CB(1) receptor antagonists. Bioorg Med Chem Lett20:1752-7 (2010) 
 
Cannabinoid receptor 2
Name:Cannabinoid receptor 2
Type:G Protein-Coupled Receptor (GPCR)
Mol. Mass.:39690.94
Organism:Homo sapiens (Human)
Description:P34972
Residue:360
BDBM50300458
NameBDBM50300458
Synonyms:3-(4-chlorophenyl)-N'-(4,4-difluoropiperidin-1-ylsulfonyl)-N-methyl-4-phenyl-4,5-dihydro-1H-pyrazole-1-carboximidamide | CHEMBL578421
TypeSmall organic molecule
Emp. Form.C22H24ClF2N5O2S
Mol. Mass.495.973
SMILESCN=C(NS(=O)(=O)N1CCC(F)(F)CC1)N1CC(C(=N1)c1ccc(Cl)cc1)c1ccccc1