Reaction Details
TargetCannabinoid receptor 1
LigandBDBM50312819
Substrate/Competitorn/a
Meas. Tech.ChEMBL_615852 (CHEMBL1101962)
Ki 280±n/a nM
Citation Lange, JHvan der Neut, MAden Hartog, APWals, HCHoogendoorn, Jvan Stuivenberg, HHvan Vliet, BJKruse, CG Synthesis, SAR and intramolecular hydrogen bonding pattern of 1,3,5-trisubstituted 4,5-dihydropyrazoles as potent cannabinoid CB(1) receptor antagonists. Bioorg Med Chem Lett20:1752-7 (2010) 
 
Cannabinoid receptor 1
Name:Cannabinoid receptor 1
Type:G Protein-Coupled Receptor (GPCR)
Mol. Mass.:52868.96
Organism:Homo sapiens (Human)
Description:P21554
Residue:472
BDBM50312819
NameBDBM50312819
Synonyms:(S)-1-(4-chlorophenyl)-N'-(4,4-difluoropiperidin-1-ylsulfonyl)-N-methyl-5-phenyl-4,5-dihydro-1H-pyrazole-3-carboximidamide | CHEMBL1076584
TypeSmall organic molecule
Emp. Form.C22H24ClF2N5O2S
Mol. Mass.495.973
SMILESCNC(=NS(=O)(=O)N1CCC(F)(F)CC1)C1=NN([C@@H](C1)c1ccccc1)c1ccc(Cl)cc1