Reaction Details
TargetC-C chemokine receptor type 5
LigandBDBM50312848
Substrate/Competitorn/a
Meas. Tech.ChEMBL_615873 (CHEMBL1102707)
IC50 5±n/a nM
Citation Lemoine, RCPetersen, ACSetti, LBaldinger, TWanner, JJekle, AHeilek, GdeRosier, AJi, CRotstein, DM Evaluation of a 3-amino-8-azabicyclo[3.2.1]octane replacement in the CCR5 antagonist maraviroc. Bioorg Med Chem Lett20:1674-6 (2010) 
 
C-C chemokine receptor type 5
Name:C-C chemokine receptor type 5
Type:Enzyme
Mol. Mass.:40540.21
Organism:Homo sapiens (Human)
Description:P51681
Residue:352
BDBM50312848
NameBDBM50312848
Synonyms:CHEMBL1087153 | N-((S)-3-((1R,3S,5S)-3-(3,5-dimethyl-4H-1,2,4-triazol-4-yl)-8-azabicyclo[3.2.1]octan-8-yl)-1-(3-fluorophenyl)propyl)-4,4-difluorocyclohexanecarboxamide
TypeSmall organic molecule
Emp. Form.C27H36F3N5O
Mol. Mass.503.6028
SMILESCc1nnc(C)n1[C@@H]1C[C@@H]2CC[C@H](C1)N2CC[C@H](NC(=O)C1CCC(F)(F)CC1)c1cccc(F)c1