Reaction Details
TargetProtein kinase C alpha type
LigandBDBM50313000
Substrate/Competitorn/a
Meas. Tech.ChEMBL_616121 (CHEMBL1102984)
IC50 1000±n/a nM
Citation Gong, LHirschfeld, DTan, YCHeather Hogg, JPeltz, GAvnur, ZDunten, P Discovery of potent and bioavailable GSK-3beta inhibitors. Bioorg Med Chem Lett20:1693-6 (2010) 
 
Protein kinase C alpha type
Name:Protein kinase C alpha type
Type:Enzyme
Mol. Mass.:76755.65
Organism:Homo sapiens (Human)
Description:The recombinant human PKC enzymes were produced using a baculovirus expression system in SF9 cells
Residue:672
BDBM50313000
NameBDBM50313000
Synonyms:(R)-3-(3-(2,3-dihydroxypropyl)phenyl)-4-(1-methyl-1H-indol-3-yl)-1H-pyrrole-2,5-dione | CHEMBL1081294
TypeSmall organic molecule
Emp. Form.C22H20N2O4
Mol. Mass.376.4052
SMILESCn1cc(C2=C(C(=O)NC2=O)c2cccc(C[C@@H](O)CO)c2)c2ccccc12