Reaction Details
TargetCyclin-dependent kinase 19
LigandBDBM50312990
Substrate/Competitorn/a
Meas. Tech.ChEMBL_616241 (CHEMBL1101134)
Kd 40000±n/a nM
Citation Gong, LHirschfeld, DTan, YCHeather Hogg, JPeltz, GAvnur, ZDunten, P Discovery of potent and bioavailable GSK-3beta inhibitors. Bioorg Med Chem Lett20:1693-6 (2010) 
 
Cyclin-dependent kinase 19
Name:Cyclin-dependent kinase 19
Type:Serine/Threonine protein kinase
Mol. Mass.:56816.68
Organism:Homo sapiens (Human)
Description:Q9BWU1
Residue:502
BDBM50312990
NameBDBM50312990
Synonyms:(R,S)-3-(3-(2,3-dihydroxypropylamino)phenyl)-4-(5-fluoro-1-methyl-1H-indol-3-yl)-1H-pyrrole-2,5-dione | CHEMBL1082152
TypeSmall organic molecule
Emp. Form.C22H20FN3O4
Mol. Mass.409.4103
SMILESCn1cc(C2=C(C(=O)NC2=O)c2cccc(NCC(O)CO)c2)c2cc(F)ccc12