Reaction Details
TargetDual specificity protein kinase CLK1
LigandBDBM50312990
Substrate/Competitorn/a
Meas. Tech.ChEMBL_616128 (CHEMBL1102991)
Kd 16±n/a nM
Citation Gong, LHirschfeld, DTan, YCHeather Hogg, JPeltz, GAvnur, ZDunten, P Discovery of potent and bioavailable GSK-3beta inhibitors. Bioorg Med Chem Lett20:1693-6 (2010) 
 
Dual specificity protein kinase CLK1
Name:Dual specificity protein kinase CLK1
Type:Protein
Mol. Mass.:57322.21
Organism:Homo sapiens (Human)
Description:P49759
Residue:484
BDBM50312990
NameBDBM50312990
Synonyms:(R,S)-3-(3-(2,3-dihydroxypropylamino)phenyl)-4-(5-fluoro-1-methyl-1H-indol-3-yl)-1H-pyrrole-2,5-dione | CHEMBL1082152
TypeSmall organic molecule
Emp. Form.C22H20FN3O4
Mol. Mass.409.4103
SMILESCn1cc(C2=C(C(=O)NC2=O)c2cccc(NCC(O)CO)c2)c2cc(F)ccc12