Reaction Details
TargetGlycogen synthase kinase-3 beta
LigandBDBM50312995
Substrate/Competitorn/a
Meas. Tech.ChEMBL_616120 (CHEMBL1102983)
IC50 2000±n/a nM
Citation Gong, LHirschfeld, DTan, YCHeather Hogg, JPeltz, GAvnur, ZDunten, P Discovery of potent and bioavailable GSK-3beta inhibitors. Bioorg Med Chem Lett20:1693-6 (2010) 
 
Glycogen synthase kinase-3 beta
Name:Glycogen synthase kinase-3 beta
Type:Enzyme
Mol. Mass.:46756.38
Organism:Homo sapiens (Human)
Description:P49841
Residue:420
BDBM50312995
NameBDBM50312995
Synonyms:3-(1-methyl-1H-indol-3-yl)-4-(phenylthio)-1H-pyrrole-2,5-dione | CHEMBL1086733
TypeSmall organic molecule
Emp. Form.C19H14N2O2S
Mol. Mass.334.392
SMILESCn1cc(C2=C(Sc3ccccc3)C(=O)NC2=O)c2ccccc12