Reaction Details
TargetGlycogen synthase kinase-3 beta
LigandBDBM50313002
Substrate/Competitorn/a
Meas. Tech.ChEMBL_616120 (CHEMBL1102983)
IC50 35±n/a nM
Citation Gong, LHirschfeld, DTan, YCHeather Hogg, JPeltz, GAvnur, ZDunten, P Discovery of potent and bioavailable GSK-3beta inhibitors. Bioorg Med Chem Lett20:1693-6 (2010) 
 
Glycogen synthase kinase-3 beta
Name:Glycogen synthase kinase-3 beta
Type:Enzyme
Mol. Mass.:46756.38
Organism:Homo sapiens (Human)
Description:P49841
Residue:420
BDBM50313002
NameBDBM50313002
Synonyms:3-(1,6-dimethyl-1H-indol-3-yl)-4-(3-methoxyphenyl)-1H-pyrrole-2,5-dione | CHEMBL1081128
TypeSmall organic molecule
Emp. Form.C21H18N2O3
Mol. Mass.346.3792
SMILESCOc1cccc(c1)C1=C(C(=O)NC1=O)c1cn(C)c2cc(C)ccc12