Reaction Details
TargetGlycogen synthase kinase-3 beta
LigandBDBM2647
Substrate/Competitorn/a
Meas. Tech.ChEMBL_616120 (CHEMBL1102983)
IC50 1.8±n/a nM
Citation Gong, LHirschfeld, DTan, YCHeather Hogg, JPeltz, GAvnur, ZDunten, P Discovery of potent and bioavailable GSK-3beta inhibitors. Bioorg Med Chem Lett20:1693-6 (2010) 
 
Glycogen synthase kinase-3 beta
Name:Glycogen synthase kinase-3 beta
Type:Enzyme
Mol. Mass.:46756.38
Organism:Homo sapiens (Human)
Description:P49841
Residue:420
BDBM2647
NameBDBM2647
Synonyms:(Phenylindolyl)maleimide deriv. 69 | 3-(3-aminophenyl)-4-(1-methyl-1H-indol-3-yl)-2,5-dihydro-1H-pyrrole-2,5-dione
TypeSmall organic molecule
Emp. Form.C19H15N3O2
Mol. Mass.317.3413
SMILESCn1cc(C2=C(C(=O)NC2=O)c2cccc(N)c2)c2ccccc12